{"text_format":"1","workbook":"xlsx","n_sheets":5,"sheets":["定率法","定額法","(記載例)定率法","(記載例)定額法","（削除禁止）償却率"],"not_rendered":{"charts":0,"images":1,"macros":1,"external_links":0,"defined_names":4,"comments":0,"pivot_tables":0},"unopened":[],"bounds":{"document_bytes":16777216,"sheet_cells":100000,"rows_first":2000,"rows_last":500,"rows_between":2000,"halvings":0,"cell_chars":16384,"cell_head_chars":4096},"cells_cut":0,"cells_raw":0,"read":"whole","date_system":"1900"}

{"sheet":"定率法","index":0,"n_rows":65,"n_cols":9,"rows_kept":65,"cut":false,"hidden":false,"merged":[[4,1,4,5],[27,1,27,5]]}
[]
["【残存簿価相当額・補助金相当額計算書】"]
[null,"決 算 月：",null,null,"償却額の端数処理："]
["１．残存簿価相当額計算"]
["財産名①："]
[null,"登録日：",null,null,"償却方法：",{"$f":"IF(C6<=DATE(2007,3,31),\"旧定率法\",\"定率法\")","v":"旧定率法"}]
[null,"処分時期：",null,null,"耐用年数："]
[null,"財産取得価格(税抜)：",null,null,"償却率：",{"$f":"IF(F7=\"\",\"\",IF(C6<=DATE(2007,3,31),VLOOKUP(F7,'（削除禁止）償却率'!A:J,4,FALSE),IF(C6>=DATE(2012,4,1),VLOOKUP(F7,'（削除禁止）償却率'!A:J,8,FALSE),VLOOKUP(F7,'（削除禁止）償却率'!A:J,5,FALSE))))","v":""}]
[null,"保証率：",{"$f":"IF(C6<=DATE(2007,3,31),\"\",IF(C6>=DATE(2012,4,1),VLOOKUP(F7,'（削除禁止）償却率'!A:J,10,FALSE),VLOOKUP(F7,'（削除禁止）償却率'!A:J,7,FALSE)))","v":""},null,"償却保証額：",{"$f":"IF(C9=\"\",\"\",C8*C9)","v":""}]
[null,null,null,null,"改定償却率：",{"$f":"IF(C6<=DATE(2007,3,31),\"\",IF(C6>=DATE(2012,4,1),VLOOKUP(F7,'（削除禁止）償却率'!A:J,9,FALSE),VLOOKUP(F7,'（削除禁止）償却率'!A:J,6,FALSE)))","v":""}]
["西暦",null,"か月",null,"償却額\n（端数処理後）","期末帳簿価格"]
[{"$f":"IF(C3=12,YEAR(C6),IF(C3<MONTH(C6),YEAR(C6),YEAR(C6)-1))","v":1900},1,{"$f":"IF(OR($C$3=\"\",$C$6=\"\"),0,IF($C$3=12,12-MONTH(C6)+1,IF($C$3<MONTH(C6),12+$C$3-MONTH(C6)+1,$C$3-MONTH(C6)+1)))","v":0},{"$f":"IF(F8=\"\",\"\",IF(F6=\"旧定率法\",C8*F8*C12/12,IF(C8*F8>F9,C8*F8*C12/12,C8*F10*C12/12)))","v":""},null,{"$f":"C8-E12","v":0},null,{"$f":"IF(F9=\"\",IF(SUM(E12:E12)+(C8*F8)<=C8*0.95,1,0),1)","v":{"$error":"#VALUE!"}},{"$f":"IF(C8*F8>F9,1,0)","v":{"$error":"#VALUE!"}}]
[{"$f":"A12+1","v":1901},2,{"$f":"IF(OR($C$3=\"\",$C$6=\"\"),0,IF(DATEDIF(DATE(YEAR(C6),MONTH(C6),1),DATE(YEAR(C7),MONTH(C7)+1,1),\"m\")-SUM(C12:C12)>=12,12,DATEDIF(DATE(YEAR(C6),MONTH(C6),1),DATE(YEAR(C7),MONTH(C7)+1,1),\"m\")-SUM(C12:C12)))","v":0},{"$f":"IF(F8=\"\",\"\",IF(F6=\"旧定率法\",IF(F12*F8<=F12-C8*0.05,F12*F8*C13/12,IF(OFFSET(H13,-1,0)=1,(F12-C8*0.05)*C13/12,IF(F12-OFFSET(F12,MATCH(0,H12:H26,0)-1,0)/5<=0,F12-1,OFFSET(F12,MATCH(0,H12:H26,0)-1,0)/5*C13/12))),IF(F12*F8>F9,F12*F8*C13/12,IF(OFFSET(F12,MATCH(0,I12:I26,0)-2,0)-OFFSET(F12,MATCH(0,I12:I26,0)-2,0)*F10>0,OFFSET(F12,MATCH(0,I12:I26,0)-2,0)*F10*C13/12,IF(OFFSET(I13,-1,0)=1,OFFSET(F12,MATCH(0,I12:I26,0)-2,0)-1,0)))))","v":""},null,{"$f":"F12-E13","v":0},null,{"$f":"IF(F9=\"\",IF(SUM(E12:E12)+(F12*F8)<=C8*0.95,1,0),1)","v":{"$error":"#VALUE!"}},{"$f":"IF(F12*F8>F9,1,0)","v":{"$error":"#VALUE!"}}]
[1902,3,{"$f":"IF(OR($C$3=\"\",$C$6=\"\"),0,IF(DATEDIF(DATE(YEAR(C6),MONTH(C6),1),DATE(YEAR(C7),MONTH(C7)+1,1),\"m\")-SUM(C12:C13)>=12,12,DATEDIF(DATE(YEAR(C6),MONTH(C6),1),DATE(YEAR(C7),MONTH(C7)+1,1),\"m\")-SUM(C12:C13)))","v":0},{"$f":"IF(F8=\"\",\"\",IF(F6=\"旧定率法\",IF(F13*F8<=F13-C8*0.05,F13*F8*C14/12,IF(OFFSET(H14,-1,0)=1,(F13-C8*0.05)*C14/12,IF(F13-OFFSET(F12,MATCH(0,H12:H26,0)-1,0)/5<=0,F13-1,OFFSET(F12,MATCH(0,H12:H26,0)-1,0)/5*C14/12))),IF(F13*F8>F9,F13*F8*C14/12,IF(OFFSET(F12,MATCH(0,I12:I26,0)-2,0)-OFFSET(F12,MATCH(0,I12:I26,0)-2,0)*F10>0,OFFSET(F12,MATCH(0,I12:I26,0)-2,0)*F10*C14/12,IF(OFFSET(I14,-1,0)=1,OFFSET(F12,MATCH(0,I12:I26,0)-2,0)-1,0)))))","v":""},null,{"$f":"F13-E14","v":0},null,{"$f":"IF(F9=\"\",IF(SUM(E12:E13)+(F13*F8)<=C8*0.95,1,0),1)","v":{"$error":"#VALUE!"}},{"$f":"IF(F13*F8>F9,1,0)","v":{"$error":"#VALUE!"}}]
[1903,4,{"$f":"IF(OR($C$3=\"\",$C$6=\"\"),0,IF(DATEDIF(DATE(YEAR(C6),MONTH(C6),1),DATE(YEAR(C7),MONTH(C7)+1,1),\"m\")-SUM(C12:C14)>=12,12,DATEDIF(DATE(YEAR(C6),MONTH(C6),1),DATE(YEAR(C7),MONTH(C7)+1,1),\"m\")-SUM(C12:C14)))","v":0},{"$f":"IF(F8=\"\",\"\",IF(F6=\"旧定率法\",IF(F14*F8<=F14-C8*0.05,F14*F8*C15/12,IF(OFFSET(H15,-1,0)=1,(F14-C8*0.05)*C15/12,IF(F14-OFFSET(F12,MATCH(0,H12:H26,0)-1,0)/5<=0,F14-1,OFFSET(F12,MATCH(0,H12:H26,0)-1,0)/5*C15/12))),IF(F14*F8>F9,F14*F8*C15/12,IF(OFFSET(F12,MATCH(0,I12:I26,0)-2,0)-OFFSET(F12,MATCH(0,I12:I26,0)-2,0)*F10>0,OFFSET(F12,MATCH(0,I12:I26,0)-2,0)*F10*C15/12,IF(OFFSET(I15,-1,0)=1,OFFSET(F12,MATCH(0,I12:I26,0)-2,0)-1,0)))))","v":""},null,{"$f":"F14-E15","v":0},null,{"$f":"IF(F9=\"\",IF(SUM(E12:E14)+(F14*F8)<=C8*0.95,1,0),1)","v":{"$error":"#VALUE!"}},{"$f":"IF(F14*F8>F9,1,0)","v":{"$error":"#VALUE!"}}]
{"$rows_left_out":51}
{"sheet":"定額法","index":1,"n_rows":65,"n_cols":8,"rows_kept":65,"cut":false,"hidden":false,"merged":[[4,1,4,5],[27,1,27,5]]}
[]
["【残存簿価相当額・補助金相当額計算書】"]
[null,"決 算 月：",null,null,"償却額の端数処理："]
["１．残存簿価相当額計算"]
["財産名①："]
[null,"登録日：",null,null,"償却方法：",{"$f":"IF(C6<=DATE(2007,3,31),\"旧定額法\",\"定額法\")","v":"旧定額法"}]
[null,"処分時期：",null,null,"耐用年数："]
[null,"財産取得価格(税抜)：",null,null,"償却率：",{"$f":"IF(F7=\"\",\"\",IF(C6<=DATE(2007,3,31),VLOOKUP(F7,'（削除禁止）償却率'!A:J,2,FALSE),VLOOKUP(F7,'（削除禁止）償却率'!A:J,3,FALSE)))","v":""}]
[]
[]
["西暦",null,"か月",null,"償却額\n（端数処理後）","期末帳簿価格"]
[{"$f":"IF(C3=12,YEAR(C6),IF(C3<MONTH(C6),YEAR(C6),YEAR(C6)-1))","v":1900},1,{"$f":"IF($C$3=\"\",0,IF($C$3=12,12-MONTH(C6)+1,IF($C$3<MONTH(C6),12+$C$3-MONTH(C6)+1,$C$3-MONTH(C6)+1)))","v":0},{"$f":"IF(F8=\"\",\"\",IF(F6=\"旧定額法\",C8*F8*0.9*C12/12,C8*F8*C12/12))","v":""},null,{"$f":"C8-E12","v":0},null,{"$f":"IF(C8*F8*0.9>C8-C8*0.05,0,1)","v":{"$error":"#VALUE!"}}]
[{"$f":"A12+1","v":1901},2,{"$f":"IF($C$3=\"\",0,IF(DATEDIF(DATE(YEAR(C6),MONTH(C6),1),DATE(YEAR(C7),MONTH(C7)+1,1),\"m\")-SUM(C12:C12)>=12,12,DATEDIF(DATE(YEAR(C6),MONTH(C6),1),DATE(YEAR(C7),MONTH(C7)+1,1),\"m\")-SUM(C12:C12)))","v":0},{"$f":"IF(F8=\"\",\"\",IF(F6=\"旧定額法\",IF(C8*F8*0.9<=F12-C8*0.05,C8*F8*0.9*C13/12,IF(OFFSET(H13,-1,0)=1,(F12-C8*0.05)*C13/12,IF(F12-OFFSET(F12,MATCH(0,H12:H26,0)-1,0)/5<=0,F12-1,(OFFSET(F12,MATCH(0,H12:H26,0)-1,0))/5*C13/12))),IF(IF(F12-C8*F8*C13/12>0,C8*F8*C13/12,F12-1)>0,IF(F12-C8*F8*C13/12>0,C8*F8*C13/12,F12-1),0)))","v":""},null,{"$f":"F12-E13","v":0},null,{"$f":"IF(C8*F8*0.9>F12-C8*0.05,0,1)","v":{"$error":"#VALUE!"}}]
[1902,3,{"$f":"IF($C$3=\"\",0,IF(DATEDIF(DATE(YEAR(C6),MONTH(C6),1),DATE(YEAR(C7),MONTH(C7)+1,1),\"m\")-SUM(C12:C13)>=12,12,DATEDIF(DATE(YEAR(C6),MONTH(C6),1),DATE(YEAR(C7),MONTH(C7)+1,1),\"m\")-SUM(C12:C13)))","v":0},{"$f":"IF(F8=\"\",\"\",IF(F6=\"旧定額法\",IF(C8*F8*0.9<=F13-C8*0.05,C8*F8*0.9*C14/12,IF(OFFSET(H14,-1,0)=1,(F13-C8*0.05)*C14/12,IF(F13-OFFSET(F12,MATCH(0,H12:H26,0)-1,0)/5<=0,F13-1,(OFFSET(F12,MATCH(0,H12:H26,0)-1,0))/5*C14/12))),IF(IF(F13-C8*F8*C14/12>0,C8*F8*C14/12,F13-1)>0,IF(F13-C8*F8*C14/12>0,C8*F8*C14/12,F13-1),0)))","v":""},null,{"$f":"F13-E14","v":0},null,{"$f":"IF(C8*F8*0.9>F13-C8*0.05,0,1)","v":{"$error":"#VALUE!"}}]
[1903,4,{"$f":"IF($C$3=\"\",0,IF(DATEDIF(DATE(YEAR(C6),MONTH(C6),1),DATE(YEAR(C7),MONTH(C7)+1,1),\"m\")-SUM(C12:C14)>=12,12,DATEDIF(DATE(YEAR(C6),MONTH(C6),1),DATE(YEAR(C7),MONTH(C7)+1,1),\"m\")-SUM(C12:C14)))","v":0},{"$f":"IF(F8=\"\",\"\",IF(F6=\"旧定額法\",IF(C8*F8*0.9<=F14-C8*0.05,C8*F8*0.9*C15/12,IF(OFFSET(H15,-1,0)=1,(F14-C8*0.05)*C15/12,IF(F14-OFFSET(F12,MATCH(0,H12:H26,0)-1,0)/5<=0,F14-1,(OFFSET(F12,MATCH(0,H12:H26,0)-1,0))/5*C15/12))),IF(IF(F14-C8*F8*C15/12>0,C8*F8*C15/12,F14-1)>0,IF(F14-C8*F8*C15/12>0,C8*F8*C15/12,F14-1),0)))","v":""},null,0,null,{"$f":"IF(C8*F8*0.9>F14-C8*0.05,0,1)","v":{"$error":"#VALUE!"}}]
{"$rows_left_out":51}
{"sheet":"(記載例)定率法","index":2,"n_rows":65,"n_cols":9,"rows_kept":65,"cut":false,"hidden":false,"merged":[[4,1,4,5],[27,1,27,5]]}
[]
["【残存簿価相当額・補助金相当額計算書】"]
[null,"決 算 月：",3,null,"償却額の端数処理：","切り捨て"]
["１．残存簿価相当額計算"]
["財産名①：","AAAAAAAAA"]
[null,"登録日：","2006-03-15",null,"償却方法：",{"$f":"IF(C6<=DATE(2007,3,31),\"旧定率法\",\"定率法\")","v":"旧定率法"}]
[null,"処分時期：","2017-08-31",null,"耐用年数：",8]
[null,"財産取得価格(税抜)：",14429684,null,"償却率：",{"$f":"IF($F$7=\"\",\"\",IF(C6<=DATE(2007,3,31),VLOOKUP(F7,'（削除禁止）償却率'!A:J,4,FALSE),IF(C6>=DATE(2012,4,1),VLOOKUP(F7,'（削除禁止）償却率'!A:J,8,FALSE),VLOOKUP(F7,'（削除禁止）償却率'!A:J,5,FALSE))))","v":0.25}]
[null,"保証率：",{"$f":"IF(C6<=DATE(2007,3,31),\"\",IF(C6>=DATE(2012,4,1),VLOOKUP(F7,'（削除禁止）償却率'!A:J,10,FALSE),VLOOKUP(F7,'（削除禁止）償却率'!A:J,7,FALSE)))","v":""},null,"償却保証額：",{"$f":"IF(C9=\"\",\"\",C8*C9)","v":""}]
[null,null,null,null,"改定償却率：",{"$f":"IF(C6<=DATE(2007,3,31),\"\",IF(C6>=DATE(2012,4,1),VLOOKUP(F7,'（削除禁止）償却率'!A:J,9,FALSE),VLOOKUP(F7,'（削除禁止）償却率'!A:J,6,FALSE)))","v":""}]
["西暦",null,"か月",null,"償却額\n（端数処理後）","期末帳簿価格"]
[{"$f":"IF(C3=12,YEAR(C6),IF(C3<MONTH(C6),YEAR(C6),YEAR(C6)-1))","v":2005},1,{"$f":"IF($C$3=\"\",0,IF($C$3=12,12-MONTH(C6)+1,IF($C$3<MONTH(C6),12+$C$3-MONTH(C6)+1,$C$3-MONTH(C6)+1)))","v":1},{"$f":"IF(F8=\"\",\"\",IF(F6=\"旧定率法\",C8*F8*C12/12,IF(C8*F8>F9,C8*F8*C12/12,C8*F10*C12/12)))","v":300618.41666666669},300618,{"$f":"C8-E12","v":14129066},null,{"$f":"IF(F9=\"\",IF(SUM(E12:E12)+(C8*F8)<=C8*0.95,1,0),1)","v":1},{"$f":"IF(C8*F8>F9,1,0)","v":0}]
[{"$f":"A12+1","v":2006},2,{"$f":"IF($C$3=\"\",0,IF(DATEDIF(DATE(YEAR(C6),MONTH(C6),1),DATE(YEAR(C7),MONTH(C7)+1,1),\"m\")-SUM(C12:C12)>=12,12,DATEDIF(DATE(YEAR(C6),MONTH(C6),1),DATE(YEAR(C7),MONTH(C7)+1,1),\"m\")-SUM(C12:C12)))","v":12},{"$f":"IF(F8=\"\",\"\",IF(F6=\"旧定率法\",IF(F12*F8<=F12-C8*0.05,F12*F8*C13/12,IF(OFFSET(H13,-1,0)=1,(F12-C8*0.05)*C13/12,IF(F12-OFFSET(F12,MATCH(0,H12:H26,0)-1,0)/5<=0,F12-1,OFFSET(F12,MATCH(0,H12:H26,0)-1,0)/5*C13/12))),IF(F12*F8>F9,F12*F8*C13/12,IF(OFFSET(F12,MATCH(0,I12:I26,0)-2,0)-OFFSET(F12,MATCH(0,I12:I26,0)-2,0)*F10>0,OFFSET(F12,MATCH(0,I12:I26,0)-2,0)*F10*C13/12,IF(OFFSET(I13,-1,0)=1,OFFSET(F12,MATCH(0,I12:I26,0)-2,0)-1,0)))))","v":3532266.5},3532266,{"$f":"F12-E13","v":10596800},null,{"$f":"IF(F9=\"\",IF(SUM(E12:E12)+(F12*F8)<=C8*0.95,1,0),1)","v":1},{"$f":"IF(F12*F8>F9,1,0)","v":0}]
[2007,3,{"$f":"IF($C$3=\"\",0,IF(DATEDIF(DATE(YEAR(C6),MONTH(C6),1),DATE(YEAR(C7),MONTH(C7)+1,1),\"m\")-SUM(C12:C13)>=12,12,DATEDIF(DATE(YEAR(C6),MONTH(C6),1),DATE(YEAR(C7),MONTH(C7)+1,1),\"m\")-SUM(C12:C13)))","v":12},{"$f":"IF(F8=\"\",\"\",IF(F6=\"旧定率法\",IF(F13*F8<=F13-C8*0.05,F13*F8*C14/12,IF(OFFSET(H14,-1,0)=1,(F13-C8*0.05)*C14/12,IF(F13-OFFSET(F12,MATCH(0,H12:H26,0)-1,0)/5<=0,F13-1,OFFSET(F12,MATCH(0,H12:H26,0)-1,0)/5*C14/12))),IF(F13*F8>F9,F13*F8*C14/12,IF(OFFSET(F12,MATCH(0,I12:I26,0)-2,0)-OFFSET(F12,MATCH(0,I12:I26,0)-2,0)*F10>0,OFFSET(F12,MATCH(0,I12:I26,0)-2,0)*F10*C14/12,IF(OFFSET(I14,-1,0)=1,OFFSET(F12,MATCH(0,I12:I26,0)-2,0)-1,0)))))","v":2649200},2649200,{"$f":"F13-E14","v":7947600},null,{"$f":"IF(F9=\"\",IF(SUM(E12:E13)+(F13*F8)<=C8*0.95,1,0),1)","v":1},{"$f":"IF(F13*F8>F9,1,0)","v":0}]
[2008,4,{"$f":"IF($C$3=\"\",0,IF(DATEDIF(DATE(YEAR(C6),MONTH(C6),1),DATE(YEAR(C7),MONTH(C7)+1,1),\"m\")-SUM(C12:C14)>=12,12,DATEDIF(DATE(YEAR(C6),MONTH(C6),1),DATE(YEAR(C7),MONTH(C7)+1,1),\"m\")-SUM(C12:C14)))","v":12},{"$f":"IF(F8=\"\",\"\",IF(F6=\"旧定率法\",IF(F14*F8<=F14-C8*0.05,F14*F8*C15/12,IF(OFFSET(H15,-1,0)=1,(F14-C8*0.05)*C15/12,IF(F14-OFFSET(F12,MATCH(0,H12:H26,0)-1,0)/5<=0,F14-1,OFFSET(F12,MATCH(0,H12:H26,0)-1,0)/5*C15/12))),IF(F14*F8>F9,F14*F8*C15/12,IF(OFFSET(F12,MATCH(0,I12:I26,0)-2,0)-OFFSET(F12,MATCH(0,I12:I26,0)-2,0)*F10>0,OFFSET(F12,MATCH(0,I12:I26,0)-2,0)*F10*C15/12,IF(OFFSET(I15,-1,0)=1,OFFSET(F12,MATCH(0,I12:I26,0)-2,0)-1,0)))))","v":1986900},1986900,5960700,null,{"$f":"IF(F9=\"\",IF(SUM(E12:E14)+(F14*F8)<=C8*0.95,1,0),1)","v":1},{"$f":"IF(F14*F8>F9,1,0)","v":0}]
{"$rows_left_out":51}
{"sheet":"(記載例)定額法","index":3,"n_rows":65,"n_cols":8,"rows_kept":65,"cut":false,"hidden":false,"merged":[[4,1,4,5],[27,1,27,5]]}
[]
["【残存簿価相当額・補助金相当額計算書】"]
[null,"決 算 月：",3,null,"償却額の端数処理：","切り捨て"]
["１．残存簿価相当額計算"]
["財産名①：","AAAAAAAAAA"]
[null,"登録日：","2006-03-31",null,"償却方法：",{"$f":"IF(C6<=DATE(2007,3,31),\"旧定額法\",\"定額法\")","v":"旧定額法"}]
[null,"処分時期：","2020-10-01",null,"耐用年数：",8]
[null,"財産取得価格(税抜)：",10000000,null,"償却率：",{"$f":"IF(C6<=DATE(2007,3,31),VLOOKUP(F7,'（削除禁止）償却率'!A:J,2,FALSE),VLOOKUP(F7,'（削除禁止）償却率'!A:J,3,FALSE))","v":0.125}]
[]
[]
["西暦",null,"か月",null,"償却額\n（端数処理後）","期末帳簿価格"]
[{"$f":"IF(C3=12,YEAR(C6),IF(C3<MONTH(C6),YEAR(C6),YEAR(C6)-1))","v":2005},1,{"$f":"IF($C$3=\"\",0,IF($C$3=12,12-MONTH(C6)+1,IF($C$3<MONTH(C6),12+$C$3-MONTH(C6)+1,$C$3-MONTH(C6)+1)))","v":1},{"$f":"IF(F8=\"\",\"\",IF(F6=\"旧定額法\",C8*F8*0.9*C12/12,C8*F8*C12/12))","v":93750},93750,{"$f":"C8-E12","v":9906250},null,{"$f":"IF(C8*F8*0.9>C8-C8*0.05,0,1)","v":1}]
[{"$f":"A12+1","v":2006},2,{"$f":"IF($C$3=\"\",0,IF(DATEDIF(DATE(YEAR(C6),MONTH(C6),1),DATE(YEAR(C7),MONTH(C7)+1,1),\"m\")-SUM(C12:C12)>=12,12,DATEDIF(DATE(YEAR(C6),MONTH(C6),1),DATE(YEAR(C7),MONTH(C7)+1,1),\"m\")-SUM(C12:C12)))","v":12},{"$f":"IF(F8=\"\",\"\",IF(F6=\"旧定額法\",IF(C8*F8*0.9<=F12-C8*0.05,C8*F8*0.9*C13/12,IF(OFFSET(H13,-1,0)=1,(F12-C8*0.05)*C13/12,IF(F12-OFFSET(F12,MATCH(0,H12:H26,0)-1,0)/5<=0,F12-1,(OFFSET(F12,MATCH(0,H12:H26,0)-1,0))/5*C13/12))),IF(IF(F12-C8*F8*C13/12>0,C8*F8*C13/12,F12-1)>0,IF(F12-C8*F8*C13/12>0,C8*F8*C13/12,F12-1),0)))","v":1125000},1125000,{"$f":"F12-E13","v":8781250},null,{"$f":"IF(C8*F8*0.9>F12-C8*0.05,0,1)","v":1}]
[2007,3,{"$f":"IF($C$3=\"\",0,IF(DATEDIF(DATE(YEAR(C6),MONTH(C6),1),DATE(YEAR(C7),MONTH(C7)+1,1),\"m\")-SUM(C12:C13)>=12,12,DATEDIF(DATE(YEAR(C6),MONTH(C6),1),DATE(YEAR(C7),MONTH(C7)+1,1),\"m\")-SUM(C12:C13)))","v":12},{"$f":"IF(F8=\"\",\"\",IF(F6=\"旧定額法\",IF(C8*F8*0.9<=F13-C8*0.05,C8*F8*0.9*C14/12,IF(OFFSET(H14,-1,0)=1,(F13-C8*0.05)*C14/12,IF(F13-OFFSET(F12,MATCH(0,H12:H26,0)-1,0)/5<=0,F13-1,(OFFSET(F12,MATCH(0,H12:H26,0)-1,0))/5*C14/12))),IF(IF(F13-C8*F8*C14/12>0,C8*F8*C14/12,F13-1)>0,IF(F13-C8*F8*C14/12>0,C8*F8*C14/12,F13-1),0)))","v":1125000},1125000,{"$f":"F13-E14","v":7656250},null,{"$f":"IF(C8*F8*0.9>F13-C8*0.05,0,1)","v":1}]
[2008,4,{"$f":"IF($C$3=\"\",0,IF(DATEDIF(DATE(YEAR(C6),MONTH(C6),1),DATE(YEAR(C7),MONTH(C7)+1,1),\"m\")-SUM(C12:C14)>=12,12,DATEDIF(DATE(YEAR(C6),MONTH(C6),1),DATE(YEAR(C7),MONTH(C7)+1,1),\"m\")-SUM(C12:C14)))","v":12},{"$f":"IF(F8=\"\",\"\",IF(F6=\"旧定額法\",IF(C8*F8*0.9<=F14-C8*0.05,C8*F8*0.9*C15/12,IF(OFFSET(H15,-1,0)=1,(F14-C8*0.05)*C15/12,IF(F14-OFFSET(F12,MATCH(0,H12:H26,0)-1,0)/5<=0,F14-1,(OFFSET(F12,MATCH(0,H12:H26,0)-1,0))/5*C15/12))),IF(IF(F14-C8*F8*C15/12>0,C8*F8*C15/12,F14-1)>0,IF(F14-C8*F8*C15/12>0,C8*F8*C15/12,F14-1),0)))","v":1125000},1125000,6531250,null,{"$f":"IF(C8*F8*0.9>F14-C8*0.05,0,1)","v":1}]
{"$rows_left_out":51}
{"sheet":"（削除禁止）償却率","index":4,"n_rows":102,"n_cols":10,"rows_kept":102,"cut":false,"hidden":true,"merged":[[0,4,0,6],[0,7,0,9],[0,0,2,0],[1,1,2,1],[1,2,2,2],[1,3,2,3],[1,4,1,6],[1,7,1,9]]}
["耐用年数","平成19年3月31日以前取得","平成19年4月1日以降取得","平成19年3月31日以前取得","平成19年4月1日から平成24年3月31日までに取得",null,null,"平成24年4月1日以降に取得"]
[null,"旧定額法\n償却率","定額法\n償却率","旧定率法\n償却率","250％定率法",null,null,"200％定率法"]
[null,null,null,null,"償却率","改定償却率","保証率","償却率","改定償却率","保証率"]
[2,0.5,0.5,0.68400000000000005,1,1,0,1,1,0]
[3,0.33300000000000002,0.33400000000000002,0.53600000000000003,0.83299999999999996,1,2.7890000000000002E-2,0.66700000000000004,1,0.11089]
[4,0.25,0.25,0.438,0.625,1,5.2740000000000002E-2,0.5,1,0.12499]
[5,0.2,0.2,0.36899999999999999,0.5,1,6.2489999999999997E-2,0.4,0.5,0.108]
[6,0.16600000000000001,0.16700000000000001,0.31900000000000001,0.41699999999999998,0.5,5.7759999999999999E-2,0.33300000000000002,0.33400000000000002,9.9110000000000004E-2]
[7,0.14199999999999999,0.14299999999999999,0.28000000000000003,0.35699999999999998,0.5,5.4960000000000002E-2,0.28599999999999998,0.33400000000000002,8.6800000000000002E-2]
[8,0.125,0.125,0.25,0.313,0.33400000000000002,5.1110000000000003E-2,0.25,0.33400000000000002,7.9089999999999994E-2]
[9,0.111,0.112,0.22600000000000001,0.27800000000000002,0.33400000000000002,4.7309999999999998E-2,0.222,0.25,7.1260000000000004E-2]
[10,0.1,0.1,0.20599999999999999,0.25,0.33400000000000002,4.4479999999999999E-2,0.2,0.25,6.5519999999999995E-2]
[11,0.09,9.0999999999999998E-2,0.189,0.22700000000000001,0.25,4.1230000000000003E-2,0.182,0.2,5.9920000000000001E-2]
[12,8.3000000000000004E-2,8.4000000000000005E-2,0.17499999999999999,0.20799999999999999,0.25,3.8699999999999998E-2,0.16700000000000001,0.2,5.5660000000000001E-2]
[13,7.5999999999999998E-2,7.6999999999999999E-2,0.16200000000000001,0.192,0.2,3.6330000000000001E-2,0.154,0.16700000000000001,5.1799999999999999E-2]
{"$rows_left_out":87}